I’m trying to set up root5.34.08 on ubuntu16.04 system.When giving command “cmake --build . – -j2”.I get the following error:
9%] Building CXX object cint/cint/CMakeFiles/Cint_static.dir/src/Typedf.cxx.o
graf2d/asimage/CMakeFiles/AFTERIMAGE.dir/build.make:64: recipe for target ‘graf2d/asimage/libAfterImage/libAfterImage.a’ failed
make[2]: *** [graf2d/asimage/libAfterImage/libAfterImage.a] Error 2
CMakeFiles/Makefile2:7540: recipe for target ‘graf2d/asimage/CMakeFiles/AFTERIMAGE.dir/all’ failed
make[1]: *** [graf2d/asimage/CMakeFiles/AFTERIMAGE.dir/all] Error 2
make[1]: *** Waiting for unfinished jobs…
[ 9%] Building CXX object cint/cint/CMakeFiles/Cint_static.dir/src/bc_autoobj.cxx.o
[ 9%] Building CXX object cint/cint/CMakeFiles/Cint_static.dir/src/expr.cxx.o
[ 10%] Building CXX object cint/cint/CMakeFiles/Cint_static.dir/src/pcode.cxx.o
[ 10%] Building CXX object cint/cint/CMakeFiles/Cint_static.dir/src/pragma.cxx.o
[ 10%] Building CXX object cint/cint/CMakeFiles/Cint_static.dir/src/Type.cxx.o
[ 10%] Building CXX object cint/cint/CMakeFiles/Cint_static.dir/src/bc_exec.cxx.o
[ 10%] Building CXX object cint/cint/CMakeFiles/Cint_static.dir/src/debug.cxx.o
[ 10%] Building CXX object cint/cint/CMakeFiles/Cint_static.dir/src/opr.cxx.o
[ 10%] Building CXX object cint/cint/CMakeFiles/Cint_static.dir/src/fread.cxx.o
[ 10%] Building CXX object cint/cint/CMakeFiles/Cint_static.dir/src/stub.cxx.o
[ 10%] Building CXX object cint/cint/CMakeFiles/Cint_static.dir/src/bc_eh.cxx.o
[ 10%] Building CXX object cint/cint/CMakeFiles/Cint_static.dir/src/auxu.cxx.o
[ 10%] Building CXX object cint/cint/CMakeFiles/Cint_static.dir/src/val2a.cxx.o
[ 10%] Building CXX object cint/cint/CMakeFiles/Cint_static.dir/src/sizeof.cxx.o
[ 10%] Building CXX object cint/cint/CMakeFiles/Cint_static.dir/src/inherit.cxx.o
[ 10%] Building CXX object cint/cint/CMakeFiles/Cint_static.dir/src/disp.cxx.o
[ 10%] Building CXX object cint/cint/CMakeFiles/Cint_static.dir/src/rflx_gendict.cxx.o
[ 10%] Building CXX object cint/cint/CMakeFiles/Cint_static.dir/src/CallFunc.cxx.o
[ 10%] Building CXX object cint/cint/CMakeFiles/Cint_static.dir/src/end.cxx.o
[ 10%] Building CXX object cint/cint/CMakeFiles/Cint_static.dir/src/bc_type.cxx.o
[ 10%] Building CXX object cint/cint/CMakeFiles/Cint_static.dir/src/var.cxx.o
[ 10%] Building CXX object cint/cint/CMakeFiles/Cint_static.dir/src/Class.cxx.o
[ 11%] Building CXX object cint/cint/CMakeFiles/Cint_static.dir/src/bc_parse.cxx.o
[ 11%] Building CXX object cint/cint/CMakeFiles/Cint_static.dir/src/gcoll.cxx.o
[ 11%] Building CXX object cint/cint/CMakeFiles/Cint_static.dir/src/global2.cxx.o
[ 11%] Building CXX object cint/cint/CMakeFiles/Cint_static.dir/src/typedef.cxx.o
[ 11%] Building CXX object cint/cint/CMakeFiles/Cint_static.dir/src/ifunc.cxx.o
[ 11%] Building CXX object cint/cint/CMakeFiles/Cint_static.dir/src/bc_reader.cxx.o
[ 11%] Building CXX object cint/cint/CMakeFiles/Cint_static.dir/src/newlink.cxx.o
[ 11%] Building CXX object cint/cint/CMakeFiles/Cint_static.dir/src/memtest.cxx.o
[ 11%] Building CXX object cint/cint/CMakeFiles/Cint_static.dir/src/parse.cxx.o
[ 11%] Building CXX object cint/cint/CMakeFiles/Cint_static.dir/src/dump.cxx.o
[ 11%] Building CXX object cint/cint/CMakeFiles/Cint_static.dir/src/FastAllocString.cxx.o
[ 11%] Building CXX object cint/cint/CMakeFiles/Cint_static.dir/src/bc_assign.cxx.o
[ 11%] Building CXX object cint/cint/CMakeFiles/Cint_static.dir/src/BaseCls.cxx.o
[ 11%] Building CXX object cint/cint/CMakeFiles/Cint_static.dir/src/new.cxx.o
[ 11%] Building CXX object cint/cint/CMakeFiles/Cint_static.dir/src/scrupto.cxx.o
[ 11%] Building CXX object cint/cint/CMakeFiles/Cint_static.dir/src/MethodAr.cxx.o
[ 11%] Building CXX object cint/cint/CMakeFiles/Cint_static.dir/src/bc_cfunc.cxx.o
[ 11%] Building CXX object cint/cint/CMakeFiles/Cint_static.dir/src/quote.cxx.o
[ 11%] Building CXX object cint/cint/CMakeFiles/Cint_static.dir/src/pause.cxx.o
[ 11%] Building CXX object cint/cint/CMakeFiles/Cint_static.dir/src/Method.cxx.o
[ 11%] Building CXX object cint/cint/CMakeFiles/Cint_static.dir/src/init.cxx.o
[ 12%] Building CXX object cint/cint/CMakeFiles/Cint_static.dir/src/Token.cxx.o
[ 12%] Building CXX object cint/cint/CMakeFiles/Cint_static.dir/src/input.cxx.o
[ 12%] Building CXX object cint/cint/CMakeFiles/Cint_static.dir/src/random.cxx.o
[ 12%] Building CXX object cint/cint/CMakeFiles/Cint_static.dir/src/bc_debug.cxx.o
[ 12%] Building CXX object cint/cint/CMakeFiles/Cint_static.dir/src/value.cxx.o
[ 12%] Building CXX object cint/cint/CMakeFiles/Cint_static.dir/src/shl.cxx.o
[ 12%] Building CXX object cint/cint/CMakeFiles/Cint_static.dir/src/global1.cxx.o
[ 12%] Building CXX object cint/cint/CMakeFiles/Cint_static.dir/src/DataMbr.cxx.o
[ 12%] Building CXX object cint/cint/CMakeFiles/Cint_static.dir/src/rflx_gensrc.cxx.o
[ 12%] Building CXX object cint/cint/CMakeFiles/Cint_static.dir/src/struct.cxx.o
[ 12%] Building CXX object cint/cint/CMakeFiles/Cint_static.dir/src/intrpt.cxx.o
[ 12%] Building CXX object cint/cint/CMakeFiles/Cint_static.dir/src/malloc.cxx.o
[ 12%] Building CXX object cint/cint/CMakeFiles/Cint_static.dir/src/macro.cxx.o
[ 12%] Building CXX object cint/cint/CMakeFiles/Cint_static.dir/src/tmplt.cxx.o
[ 12%] Building CXX object cint/cint/CMakeFiles/Cint_static.dir/src/bc_item.cxx.o
[ 12%] Building CXX object cint/cint/CMakeFiles/Cint_static.dir/src/bc_vtbl.cxx.o
[ 12%] Building CXX object cint/cint/CMakeFiles/Cint_static.dir/src/Api.cxx.o
[ 12%] Building CXX object cint/cint/CMakeFiles/Cint_static.dir/src/dict/Apiif.cxx.o
[ 12%] Building CXX object cint/cint/CMakeFiles/Cint_static.dir/src/dict/stdstrct.cxx.o
[ 12%] Building CXX object cint/cint/CMakeFiles/Cint_static.dir/src/dict/gcc4strm.cxx.o
[ 12%] Linking CXX static library …/…/lib/libCint_static.a
[ 12%] Built target Cint_static
Makefile:149: recipe for target ‘all’ failed
make: *** [all] Error 2
I am new for ubuntu and root,and I know little about them
I would be grateful for any help