Error in Cling while installing root


hello everyone can you please help me solve this problem
after running the ‘make -j4’ command I got this error

collect2: error: ld returned 1 exit status
make[2]: *** [core/rootcling_stage1/CMakeFiles/rootcling_stage1.dir/build.make:243: core/rootcling_stage1/src/rootcling_stage1] Error 1
make[1]: *** [CMakeFiles/Makefile2:26166: core/rootcling_stage1/CMakeFiles/rootcling_stage1.dir/all] Error 2
make[1]: *** Waiting for unfinished jobs…
[ 78%] Built target Cling
make: *** [Makefile:156: all] Error 2

There are other error messages before that message. Could you share those?

This topic was automatically closed 14 days after the last reply. New replies are no longer allowed.