Error compilation root5.30.05 with SolarisCCDictHack.h

Hello Rooters

I try to compile root5.30.05 on fedora 15 and i get this error :

In file included from /home/global/root/root5.30_05fc15/graf3d/eve/src/G__Eve2.cxx:17:0:
/home/global/root/root5.30_05fc15/graf3d/eve/src/G__Eve2.h:97:69: fatal error: /home/global/root/root/graf3d/eve/src/SolarisCCDictHack.h: No such file or directory
compilation terminated.
make: *** [graf3d/eve/src/G__Eve1.o] Error 1
make: *** Waiting for unfinished jobs…
make: *** [graf3d/eve/src/G__Eve2.o] Error 1

On same computer root5.28.00-h is ok.

Thanks for your help

Luc

Hello

With version 5.32, we don’t have this problem!
So, it’s ok now!

Luc